{"text_format":"1","workbook":"xlsx","n_sheets":3,"sheets":["PAGE 1","Page2","DATA"],"not_rendered":{"charts":0,"images":0,"macros":0,"external_links":0,"defined_names":13,"comments":1,"pivot_tables":0},"unopened":[],"bounds":{"document_bytes":16777216,"sheet_cells":100000,"rows_first":2000,"rows_last":500,"rows_between":2000,"halvings":0,"cell_chars":16384,"cell_head_chars":4096},"cells_cut":0,"cells_raw":0,"read":"whole","date_system":"1900"}

{"sheet":"PAGE 1","index":0,"n_rows":38,"n_cols":11,"rows_kept":38,"cut":false,"hidden":false,"merged":[[36,1,38,5],[37,8,37,10],[24,1,24,10],[25,1,25,8],[26,1,26,8],[27,1,27,8],[28,1,28,8],[29,1,29,8],[30,1,30,8],[31,1,31,8],[32,1,32,8],[33,1,33,2],[35,1,35,8],[23,1,23,10],[18,1,18,3],[18,4,18,7],[18,8,18,10],[19,4,19,7],[19,8,19,10],[20,4,20,7],[20,8,20,10],[21,4,21,7],[21,8,21,10],[22,1,22,3],[22,4,22,7],[22,8,22,10],[16,1,16,3],[16,4,16,7],[16,8,16,10],[17,1,17,3],[17,4,17,7],[17,8,17,10],[15,1,15,10],[6,1,6,8],[7,1,7,4],[8,1,8,4],[9,1,9,6],[10,2,10,6],[11,1,11,8],[12,1,12,10],[13,1,13,10],[14,1,14,3],[14,4,14,7],[14,8,14,10],[4,0,4,2],[4,3,4,4],[4,6,4,10],[5,0,5,2],[5,3,5,4],[5,7,5,10],[0,3,0,9],[1,0,1,1],[1,3,1,9],[2,0,2,10],[3,0,3,2],[3,3,3,4],[3,6,3,10]]}
["NEW REGIME",null,null,"INCOME  TAX  CALCULATION  STATEMENT",null,null,null,null,null,null,{"$f":"IFERROR(VLOOKUP(Page2!$C$4,GK,2,FALSE),\"\")","v":""}]
[null,null,{"$f":"'PAGE 1'!J2","v":0},"FOR  THE  PERIOD  FROM  01.04.2022  TO  31.03.2023"]
["ASSESSMENT  YEAR  2023 - 2024"]
["Name          ",null,null,{"$f":"Page2!E4","v":""},null,null,"GOVERNMENT COLLEGE OF TECHNOLOGY"]
["Designation  ",null,null,{"$f":"Page2!I4","v":0},null,null,"COIMBATORE 641 013"]
["PAN No.         ",null,null,{"$f":"Page2!K4","v":0},null,null,"TAN No.",":CMBO 03224 E"]
[1,"TOTAL ANNUAL GROSS SALARY INCOME: Including HRA, SLS, Additional Charge allowance,   Arrears and any other income (Excluding cash allowance if any)",null,null,null,null,null,null,null,"Rs.",{"$f":"Page2!E28","v":0}]
[2,"INCOME FROM HOUSE PROPERTY"]
[null,"Add:  any other income (if any) interest in fixed deposit,  divident,  NSC  Interest, etc.Interest on PCA arrs.",null,null,null,"Rs."]
[3,"GROSS  TOTAL  INCOME  [ 1 + 2 ]",null,null,null,null,null,null,null,"Rs.",{"$f":"SUM(K7+G9)","v":0}]
[4,"LESS","U / S  80 CCD [1B] :  National  to  pension  scheme  of  central  Govt. (Max.Rs.50000/-) (NPS - Fixed Deposit only)",null,null,null,null,"Rs."]
[5,"TOTAL  TAXABLE  INCOME  ( 3 - 4 )\n(Rounded  off  to  nearest  ten  rupees)",null,null,null,null,null,null,null,"Rs.",{"$f":"(K10-I11+5)-MOD(K10-I11+5,10)","v":0}]
[null,"COMPUTATION  OF  TAX: ( Rounded  off  to  nearest  one  rupee)"]
[null,"Table  1 : Tax  rates  applicable  to  Men and Women Employees      "]
[null,"TAXABLE  INCOME",null,null,"INCOME  TAX  RATE",null,null,null,"INCOME  TAX                                          Rs."]
[null,"Deduction u/s 80C, 80D Not permitted"]
[null,"Upto  Rs.2,50,000",null,null,"Nil",null,null,null,"Nil"]
[null,"Rs.2,50,001  to  Rs.5,00,000",null,null,"5%  of  the  amt  exceeding  Rs.2,50,000",null,null,null,{"$f":"IF(AND(K12>250000,K12<=500000),(K12-250000)*5%,0)","v":0}]
[null,"Rs.5,00,001  to  Rs.7,50,000",null,null,"Rs.12,500 + 10% of amt exceeding Rs.5,00,000",null,null,null,{"$f":"IF(AND(K12>500000,K12<=750000),(K12-500000)*10%+12500,0)","v":0}]
[null,"Rs.7,50,001  to  Rs.10,00,000",null,null,"Rs.37,500 + 15% of amt exceeding Rs.7,50,000",null,null,null,{"$f":"IF(AND(K12>750000,K12<=1000000),(K12-750000)*15%+37500,0)","v":0}]
[null,"Rs.10,00,001  to  Rs.12,50,000",null,null,"Rs.75,000 + 20% of amt exceeding Rs.10,00,000",null,null,null,{"$f":"IF(AND(K12>1000000,K12<=1250000),(K12-1000000)*20%+75000,0)","v":0}]
[null,"Rs.12,50,001  to  Rs.15,00,000",null,null,"Rs.1,25,000 + 25% of amt exceeding Rs.12,50,000",null,null,null,{"$f":"IF(AND(K12>1250000,K12<=1500000),(K12-1250000)*25%+125000,0)","v":0}]
[null,"Exceeding  Rs.15,00,000",null,null,"Rs.1,87,500 + 30% of the amt exceeding Rs.15,00,000",null,null,null,{"$f":"IF(K12>1500000,(K12-1500000)*30%+187500,0)","v":0}]
[null,"Table  2 : Education Cess"]
[null,"Education  cess of  4% is payable on  total tax"]
[6,"Tax  payable  on  Taxable  Income  :                                                                                                      \n(As per  table  1 or 2  as  above)",null,null,null,null,null,null,null,"Rs.",{"$f":"IF(I18<>0,I18,IF(I19<>0,I19,IF(I20<>0,I20,IF(I21<>0,I21,IF(I22<>0,I22,I23)))))","v":0}]
[7,"Less: Rebate u/s 87A (Rs.12500/-)\n(Applicable if the Total Taxable Income does not exceed Rs.5,00,000/-)",null,null,null,null,null,null,null,"Rs.",{"$f":"IF(AND(K12<=500000,K26<12500),K26,IF(AND(K12<=500000,K26<>0,K26>=12500),12500,0))","v":0}]
[8,"Tax  payable  on  Taxable  Income ",null,null,null,null,null,null,null,"Rs.",{"$f":"K26-K27","v":0}]
[9,"ADD :  Education  cess  @ 4%  on  Tax  Payable",null,null,null,null,null,null,null,"Rs.",{"$f":"K28*4%","v":0}]
[10,"Total  Tax  Payable",null,null,null,null,null,null,null,"Rs.",{"$f":"IF(K28+K29<>0,K28+K29,\"NIL\")","v":"NIL"}]
[11,"LESS : Rebate  u / s 86, 89, 90  or  91",null,null,null,null,null,null,null,"Rs."]
[12,"LESS : Pre paid  Tax (Advance  tax,  TDS)",null,null,null,null,null,null,null,"Rs.",{"$f":"IFERROR(SUM(Page2!$I$28+$E$34+H34),Page2!$I$28)","v":0}]
[13,"Balance Income Tax with Education cess to  be  deducted in February 2023/ Refund",null,null,null,null,null,null,null,"Rs.",{"$f":"IFERROR(IFERROR(K30-(K31+K32)-H34,K30-(K31+K32)),\"NIL\")","v":"NIL"}]
[14,"Paid by Challan",null,"TAN",null,null,"PAN",null,"FORM16","Rs.",{"$f":"IFERROR(K32-H34,\"\")","v":0}]
[]
[null,"COUNTERSIGNED"]
[null,"FOR PRINCIPAL \nGOVT COLLEGE OF TECHNOLOGY, COIMBATORE 13",null,null,null,null,null,"Signature:"]
[null,null,null,null,null,null,null,"Designation:",{"$f":"D5","v":0}]

{"sheet":"Page2","index":1,"n_rows":37,"n_cols":12,"rows_kept":37,"cut":false,"hidden":false,"merged":[[27,6,27,7],[36,8,36,11],[19,10,19,11],[36,1,36,4],[4,3,5,3],[4,4,5,4],[4,5,5,5],[4,8,5,8],[4,2,5,2],[25,2,25,7],[27,2,27,3],[27,4,27,5],[0,1,0,11],[1,1,1,11],[3,4,3,6],[3,10,3,11],[4,1,5,1],[4,6,5,6],[4,7,5,7],[4,10,5,11]]}
[null,"STATEMENT SHOWING THE PAY AND OTHER ALLOWANCES DRAWN AND DEDUCTIONS PARTICULARS"]
[null,"  FOR  THE FINANCIAL YEAR  2022 - 2023 (ASSESSMENT  YEAR   2023 - 2024)"]
[]
[null,"Emp.Code.",null,"Name.",{"$f":"IFERROR(VLOOKUP($C$4,GK,3,FALSE),\"\")","v":""},null,null,"Designation.",null,"PAN. No."]
[null,"MONTH"," Pay\nRs.","DA                    Rs.","HRA                Rs.","CCA                 Rs.","MA                 Rs.","OA               Rs.","TOTAL                                  Rs.","DEDUCTIONS","OTHER REMUNERATIONS          Rs."]
[null,null,null,null,null,null,null,null,null," IT                                  (include cess)"]
[null,"2022-03-01",null,null,null,null,null,null,{"$f":"SUM(C7:H7)","v":0},null,"BONUS"]
[null,"2022-04-01",null,null,null,null,null,null,{"$f":"SUM(C8:H8)","v":0},null,"Consult 1"]
[null,"2022-05-01",null,null,null,null,null,null,0,null,"Testing 1"]
[null,"2022-06-01",null,null,null,null,null,null,0,null,"PartTime 1"]
[null,"2022-07-01",null,null,null,null,null,null,0,null,"PartTime 2"]
[null,"2022-08-01",null,null,null,null,null,null,0,null,"EXAM"]
[null,"2022-09-01",null,null,null,null,null,null,0,null,"TFC"]
[null,"2022-10-01",null,null,null,null,null,null,0,null,"TNEA"]
[null,"2022-11-01",null,null,null,null,null,null,0,null,"Hostel"]
[null,"2022-12-01",null,null,null,null,null,null,0,null,"Others"]
[null,"2023-01-01",null,null,null,null,null,null,0,null,"Others"]
[null,"2023-02-01",null,null,null,null,null,null,0,null,"Others"]
[null,"DA ARR.",null,null,null,null,null,null,0,null,"TOTAL",{"$f":"SUBTOTAL(9,L7:L18)","v":0}]
[null,"CAS ARR.",null,null,null,null,null,null,0,null,"REM. TAXES"]
[null,"MPHIL ARR.",null,null,null,null,null,null,0,null,"Cons Tax 1"]
[null,"INCR ARR.",null,null,null,null,null,null,0,null,"Tax 3"]
[null,"ARREAR 5",null,null,null,null,null,null,0,null,"Tax 2"]
[null,"GROSS TOTAL",{"$f":"SUBTOTAL(9,C7:C23)","v":0},{"$f":"SUBTOTAL(9,D7:D23)","v":0},0,0,0,{"$f":"SUBTOTAL(9,H7:H23)","v":0},0,0,"TOTAL",{"$f":"SUBTOTAL(9,L21:L23)","v":0}]
[]
[]
[]
[null,null,"Gross Total Income",null,{"$f":"I24+L19","v":0},null,"Gross Total Income Tax",null,{"$f":"J24+L24","v":0}]
[]
[]
[]
[]
[]
[]
[]
[]
[null,"SIGNATURE OF THE EMPLOYEE",null,null,null,null,null,null,"SIGNATURE OF THE ASSESSEE"]

{"sheet":"DATA","index":2,"n_rows":273,"n_cols":3,"rows_kept":273,"cut":false,"hidden":true,"merged":[]}
[10,1,"B.NITHYAKALYANI          "]
[130,2,"M.MURUGESH               "]
[104,3,"M.THAMIZHSELVAN          "]
[105,4,"M.NITHYA                 "]
[112,5,"M.DHARMALINGAN           "]
[113,6,"S. SATHYA                "]
[109,7,"P.S.VIMALARANI           "]
[123,8,"G.PRABHU                 "]
[111,9,"P.R.RANGASAMY            "]
[114,10,"M.SABITHAMANI            "]
[115,11,"M.DEVIKA                 "]
[119,12,"T.S.VISWALINGAM          "]
[120,13,"S. MAHENDRAN             "]
[118,14,"J.ARAVINTH KUMAR         "]
[107,15,"S.ASHOKRANJAN            "]
[117,16,"P.UMADEVI                "]
[133,17,"T. KAVIYA                "]
[126,18,"K.NAGARAJAN              "]
[125,19,"T.RAJENDRAN              "]
[106,20,"C.KAVERI                 "]
[317,21,"M. JAIKUMARI             "]
[348,22,"R RANGARAJ               "]
[349,23,"G.K.PREMKUMAR            "]
[356,24,"K. CHITHRA               "]
[361,25,"R.YOGANATHAN             "]
[353,26,"P.MAHESWARI              "]
[315,27,"P.GOKHUL KRISHNAN        "]
[337,28,"R. KARPAGASHANMUGI                      "]
[309,29,"S.MUTHAMIZHAN            "]
[350,30,"M. SATHYA                "]
[322,31,"P.GOMATHI                "]
[334,32,"M. SARAVANAN             "]
[310,33,"D RAVI                   "]
[311,34,"K. VIGNESH               "]
[313,35,"P. CHANDRAKUMAR          "]
[301,36,"K.NATARAJ                "]
[307,37,"P.JAGATHESAN             "]
[306,38,"MOHAN BABU S             "]
[351,39,"P.MURUGANANTHAM          "]
[305,40,"SENTHILKUMAR K           "]
[324,41,"J.SATHISH                "]
[359,42,"D. NANTHAKUMAR           "]
[367,43,"R.VIMAL SINGH            "]
[318,44,"C.ANBUMALAR              "]
[319,45,"M.KARTHIKKUMAR           "]
[325,46,"V.AMSA                   "]
[332,47,"P.GIRIJA                 "]
[333,48,"S.MURUGESAN              "]
[335,49,"D.REETA                  "]
[342,50,"S.VIJAYAKUMAR            "]
[364,51,"P.SRINIVASAN             "]
[320,52,"P.KARTHIKEYAN            "]
[304,53,"S.JAYASEELA              "]
[818,54,"R.KARTHIKEYAN            "]
[807,55,"HARINI M                 "]
[806,56,"M.MAHESWARAN             "]
[813,57,"M.VEERAMMAL              "]
[815,58,"V.SUKUMAR                "]
[848,59,"A.KARUPPATHAL            "]
[829,60,"SILAMBARASAN K           "]
[830,61,"DINESH G                 "]
[831,62,"A.J.NAZIRUDEEN           "]
[832,63,"KARUPPASAMY B            "]
[833,64,"A.KARPAGAM               "]
[835,65,"R.SASIKUMAR              "]
[836,66,"R.SELVAKUMAR             "]
[839,67,"SAKTHIVEL K              "]
[834,68,"B.NAGARAJ                "]
[802,69,"N. MARUDACHALAM          "]
[803,70,"M.MYTHEENSHA             "]
[804,71,"C.SARAVANAN              "]
[901,72,"T.NAGARAJAN              "]
[964,73,"V.MUTHUKILI              "]
[947,74,"C.PALPANDI               "]
[948,75,"VENKATACHALAM G          "]
[951,76,"B.RAGHAVADEVI            "]
[904,77,"A.MURTHY                 "]
[934,78,"B.MURALI                 "]
[936,79,"K.S.RAJAN                "]
[906,80,"P.RATHINASAMY            "]
[907,81,"GURUSAMY S               "]
[909,82,"RAMASAMY K               "]
[910,83,"N.KUMAR                  "]
[911,84,"N.DHANDAPANI             "]
[912,85,"SUBASHCHANDRABOSE P      "]
[914,86,"LOKESH R                 "]
[915,87,"RAMYA P                  "]
[916,88,"KALAISELVAN R            "]
[922,89,"G.GEORGE JOHN            "]
[925,90,"K.MANIKANDAN             "]
[953,91,"S.THIRUMOORTHY           "]
[954,92,"P.RANGASAMY              "]
[955,93,"D.SIVAKUMAR              "]
[957,94,"C.PANNEERSELVAM          "]
[958,95,"P.THAMBURAJ              "]
[960,96,"N.RANGARAJ               "]
[961,97,"R.MANIVANNAN             "]
[1136,98,"S.MURUGESAN              "]
[1158,99,"P.RAJAMMAL               "]
[917,100,"A.KUMARAVELU             "]
[918,101,"H.SATHIYANARAYANAN       "]
[919,102,"R.MOHANASUNDARAM         "]
[920,103,"R.A.DHARMARAJAN          "]
[923,104,"V.KRISHNAMOORTHY         "]
[926,105,"S. SENTHILKUMAR          "]
[1102,106,"P.BALAMURUGAN            "]
[1103,107,"K.SUBASH                 "]
[1105,108,"V.VENGATESH              "]
[1122,109,"R.SEKAR                  "]
[1123,110,"N.BALAMURUGAN            "]
[1124,111,"I.CHANDRASEKAR           "]
[1125,112,"R.THIRUVENKATASUBRAMANIAN"]
[824,113,"B.SARAVANAN              "]
[825,114,"D.SELVARASU              "]
[851,115,"K.RAMESH                 "]
[852,116,"G.VELAZHAGAN             "]
[854,117,"T.SELVAM                 "]
[856,118,"R.SARAVANAN              "]
[857,119,"G.BABU                   "]
[858,120,"G.DURAIMANIKANDAN        "]
[859,121,"P.MURUGAVEL              "]
[860,122,"P.SENTHILVELAVAN         "]
[861,123,"P.SUNDHARARAJAN          "]
[850,124,"C.SAKTHIVEL              "]
[853,125,"R.RAMACHANDRAN           "]
[838,126,"A.SIRAJUNISHABEGAME      "]
[840,127,"U.BALACHANDRAN           "]
[841,128,"N.RAJMOHAN               "]
[842,129,"S.ANBALAGAN              "]
[843,130,"J.TAMILMATHI             "]
[844,131,"P.R.ANANDHABALAN         "]
[355,132,"S. JAYSANKAR             "]
[338,133,"M. SRINIVASAN            "]
[357,134,"P. SIVARAMAN             "]
[437,135,"G.DHAMOTHARAKKANNAN      "]
[440,136,"K.REKHA                  "]
[446,137,"S.SATHYAPRIYA            "]
[450,138,"C. BHARATHI              "]
[451,139,"S.CHITHRA (CIVIL)               "]
[452,140,"M.RAMA                   "]
[461,141,"R.BHUVANESWARI           "]
[443,142,"K. RAJESH KUMAR          "]
[448,143,"P. ANDAVAR               "]
[444,144,"V.SATHEES KUMAR          "]
[407,145,"P. NIRMAL                "]
[412,146,"R.SURENDRAN              "]
[413,147,"B.RAJESWARI              "]
[414,148,"M S AEZHISAI VALLAVI     "]
[415,149,"S.BRADEESH MOORTHY       "]
[416,150,"T. SEKAR                 "]
[418,151,"RAKESH GAUTAM            "]
[417,152,"D. KULANDAIVEL           "]
[441,153,"C.MEIARAJ                "]
[442,154,"S.P.JAYAPRIYA            "]
[401,155,"S.CHITRA (EEE)              "]
[406,156,"P.MARUTHUPANDI           "]
[428,157,"G.SUCHITRA               "]
[409,158,"S.SOWKARTHIKA            "]
[419,159,"N.NANDHAKUMAR            "]
[420,160,"S.PARIMALA MURUGAVENI    "]
[462,161,"K.RAMESH                 "]
[431,162,"M.MUTHUCHELVAM           "]
[432,163,"J.DURAIKANNAN            "]
[435,164,"M.RAJESWARI              "]
[455,165,"S.AYYAPPAN (PHYSICS)               "]
[434,166,"S.ANBUCHUDAR AZHAGAN     "]
[439,167,"R.SATHYA                 "]
[453,168,"J.ANBAZHAGAN VIJAY       "]
[421,169,"M.KALPANA                "]
[457,170,"G.RAVINDRA DEVI REVATHI  "]
[402,171,"V.PRASANNA MOORTHY       "]
[403,172,"N.NARMADHAI              "]
[463,173,"R.RAJESWARI              "]
[464,174,"K.RANJITHKUMAR           "]
[433,175,"P.ASAIGEETHAN            "]
[430,176,"R.RAJENDIRAN             "]
[404,177,"SUJATHA BALARAMAN        "]
[445,178,"S.MURUGAN                "]
[576,179,"N.VADIVEL                "]
[577,180,"S.USHA                   "]
[534,181,"P.ILAMATHI               "]
[535,182,"M.SANKAR KUMAR           "]
[536,183,"A.SASIKUMAR              "]
[537,184,"G.VIJAYA RAJA RAGAVAN    "]
[538,185,"S.KUMAR                  "]
[539,186,"N.AJAY MANIKANDAN        "]
[501,187,"K.YASODA                 "]
[524,188,"O.SARANYA                "]
[549,189,"N.AMEENA BIBI            "]
[531,190,"A.MEENA KOWSHALYA        "]
[530,191,"T.RAJASENBAGAM           "]
[532,192,"L.SUMATHI                "]
[512,193,"K.KUMAR                  "]
[510,194,"R.BHAVANI                "]
[507,195,"P.N.KANNAN               "]
[525,196,"M.SAKTHIVEL              "]
[502,197,"S.LATHA VENKATESHWARI    "]
[508,198,"J.C.MIRACLIN JOYCE PAMILA"]
[509,199,"S.RATHI                  "]
[533,200,"S.MATHIVANAN             "]
[550,201,"A.ANITHA                 "]
[548,202,"P.DEEPA                  "]
[574,203,"M.C.RAVATHI              "]
[575,204,"S.MAKESH KUMAR           "]
[541,205,"C.MARIMUTHU              "]
[542,206,"A.S.WINCY PON ANNAL      "]
[543,207,"M.RAGHAPPRIYA            "]
[544,208,"N.ARULMOZHI              "]
[545,209,"G.R.RADHIKA              "]
[546,210,"A.SUGUNA                 "]
[551,211,"R.DEVI                   "]
[552,212,"M.BLESSY QUEEN MARY      "]
[553,213,"T.SUGUNA                 "]
[554,214,"M.JEYANTHI               "]
[555,215,"S.GLADSON OLIVER         "]
[556,216,"C.ASWINI                 "]
[558,217,"R.MALAVIKA               "]
[557,218,"M. GOWRI SHANKAR         "]
[559,219,"J.ARUN  BASKARAN         "]
[560,220,"R.NITHYA                 "]
[561,221,"A.THIRUNAVUKKARASU       "]
[562,222,"P.SARANYA                "]
[563,223,"K.SELVAPRIYA             "]
[564,224,"A.ANNU                   "]
[565,225,"D.ANGELINE KIRUBA        "]
[567,226,"V.KARTHIK                "]
[568,227,"S.MADHUVANTHI            "]
[570,228,"J.MERCY NISHA PAULINE    "]
[571,229,"V.RAJASEKAR              "]
[572,230,"C.MUTHUKUMARAN           "]
[573,231,"G.SHARMILA               "]
[569,232,"T.MALARVIZHI             "]
[566,233,"M.N.NAFISA BEGAM         "]
[580,234,"R. MUTHURAM              "]
[718,235,"R.R. SRIDEVI             "]
[716,236,"R.CHITHRA                "]
[707,237,"S PERIYASAMY             "]
[708,238,"S. AYYAPPAN (MECH)            "]
[715,239,"M.KUMAR                  "]
[709,240,"K.RAJUPILLAI             "]
[710,241,"M.GNANAKUMAR             "]
[711,242,"N.DEEPA                  "]
[712,243,"A.VANITHA                "]
[713,244,"L.BALAKRISHNAN           "]
[717,245,"D.VIMALA                 "]
[719,246,"E. RAGA IMA DEVI         "]
[714,247,"M.SHYAMALA               "]
[721,248,"C.SIVASANKARI            "]
[504,249,"D. KANAGARAJAN           "]
[513,250,"P. MANGAIYARKARASI       "]
[511,251,"G. THIRUGNANAM           "]
[540,252,"S. ANBU                  "]
[547,253,"B. ACHIAMMAL             "]
[422,254,"K.KUMARAVEL              "]
[411,255,"J.RANGARAJ               "]
[]
[]
[]
[]
[]
[]
[]
[]
[]
[]
[]
[]
[]
[]
[]
[]
[]
[1,2,3]